﻿Row,muscleXtimebin,MI,MI180,muscleandside,muscle,side,timebin,participant,sex,age,height,weight,bmi,falls_6mo,falls_1mo,fog_1mo,updrs_ii_13,updrs_ii_14,updrs_ii_15,updrs_ii_16,haspd,pd_duration,moca_score,abc,dysk_face,dysk_neck,dysk_rue,dysk_lue,dysk_rle,dysk_lle,fog_q_b_1,fog_q_b_2,fog_q_b_3,fog_q_b_4,fog_q_b_5,fog_q_b_6,HY,UPDRSsum,gender,updrs_iii_total,updrs_iii_legrigidity,tremor_ave,pigd_ave,pd_phenotype,pigdvshoa,PDtypevshoa,updrs_r,updrs_l,updrs_rle,updrs_lle,updrs_side,updrs_side_le,fallercategory,fallinlast12mo,BBS,FAB,DGI,freezer
BAT001PRE_kellymi_values,EMG_BFLH_L_APR1,64.2167742,56.99806077,BFLH_L,BFLH,L,APR_1_TIMEBIN,BAT001PRE,F,84,163.83,49.89,18.6,2,1,1,0,0,0,1,Yes,17,28,81.875,0,0,0,0,0,0,1,0,2,1,0,1,2.5,44,F,44,1,1.125,0,td pd,.,td pd,18,17,1,1,right,bilateral,>=2 falls in prev 12 months,Yes,52,29,20,Y
BAT002PRE_kellymi_values,EMG_BFLH_L_APR1,95.73053615,89.44894841,BFLH_L,BFLH,L,APR_1_TIMEBIN,BAT002PRE,M,53,175.26,86.1826,28.1,0,0,0,0,0,0,1,Yes,4,29,90,0,0,0,0,0,0,0,0,0,0,0,0,1.5,21,M,21,1,0.75,0.2,td pd,.,td pd,10,5,1,0,right,right,0 falls in prev 12 months,No,56,32,21,N
BAT003PRE_kellymi_values,EMG_BFLH_L_APR1,76.07003293,76.07003293,BFLH_L,BFLH,L,APR_1_TIMEBIN,BAT003PRE,F,75,163.5,57.6,21.5,4,2,1,0,0,1,0,Yes,2,27,78.125,0,0,0,0,0,0,1,0,0,1,1,0,2.5,31,F,31,2,0.25,0.6,pigd pd,pigd,pigd pd,12,11,2,0,right,right,>=2 falls in prev 12 months,Yes,52,29,22,N
BAT004PRE_kellymi_values,EMG_BFLH_L_APR1,69.93168829,68.32656192,BFLH_L,BFLH,L,APR_1_TIMEBIN,BAT004PRE,F,82,168,59.9,21.2,0,0,1,0,2,1,1,Yes,3,24,70.625,0,0,0,0,0,0,3,2,4,2,2,2,3,37,F,37,0,0.5,1.4,pigd pd,pigd,pigd pd,10,13,0,0,left,bilateral,0 falls in prev 12 months,No,44,29,,Y
BAT005PRE_kellymi_values,EMG_BFLH_L_APR1,80.39103193,80.39103193,BFLH_L,BFLH,L,APR_1_TIMEBIN,BAT005PRE,M,39,184,70.8,20.9,3,1,0,0,0,2,4,Yes,9,28,91.25,0,0,0,0,0,0,3,3,3,0,1,1,2.5,38,M,38,0,1.875,0.6,td pd,.,td pd,9,21,1,1,left,bilateral,>=2 falls in prev 12 months,Yes,56,36,23,Y
BAT006PRE_kellymi_values,EMG_BFLH_L_APR1,31.53273541,24.98873934,BFLH_L,BFLH,L,APR_1_TIMEBIN,BAT006PRE,M,66,181.5,83.6,25.4,0,0,0,0,0,0,0,Yes,1,24,85,0,0,0,0,0,0,1,1,0,0,0,0,2,22,M,22,3,0.125,0.2,pigd pd,pigd,pigd pd,6,9,1,2,left,left,0 falls in prev 12 months,No,55,32,20,N
BAT007PRE_kellymi_values,EMG_BFLH_L_APR1,81.53515693,57.97924947,BFLH_L,BFLH,L,APR_1_TIMEBIN,BAT007PRE,M,59,186,89.4,25.8,0,1,1,0,1,1,1,Yes,6,27,93.75,0,0,0,0,0,0,2,1,2,1,0,1,2,34,M,34,0,0.625,0.6,indet pd,.,indet pd,11,13,0,0,left,bilateral,0 falls in prev 12 months,No,56,37,23,Y
BAT008PRE_kellymi_values,EMG_BFLH_L_APR1,42.173488,42.173488,BFLH_L,BFLH,L,APR_1_TIMEBIN,BAT008PRE,F,71,155.5,63.8,26.4,0,0,0,0,0,1,1,Yes,3,30,96.875,0,0,0,0,0,0,1,0,0,0,0,0,2,30,F,30,0,1.125,0.6,td pd,.,td pd,14,10,2,0,right,right,0 falls in prev 12 months,No,56,36,23,N
BAT010PRE_kellymi_values,EMG_BFLH_L_APR1,70.42419067,70.42419067,BFLH_L,BFLH,L,APR_1_TIMEBIN,BAT010PRE,F,69,153.5,45.9,19.5,0,0,0,0,0,1,1,Yes,6,25,98.75,0,0,0,0,0,0,1,0,0,0,0,0,3,43,F,43,1,1.25,0.6,td pd,.,td pd,17,17,3,1,bilateral,right,>=2 falls in prev 12 months,Yes,56,33,23,N
BAT011PRE_kellymi_values,EMG_BFLH_L_APR1,50.16919241,50.16919241,BFLH_L,BFLH,L,APR_1_TIMEBIN,BAT011PRE,M,71,170,63.4,21.9,0,0,0,0,0,0,0,Yes,5,,96.25,0,0,0,0,0,0,2,0,0,0,0,0,2,33,M,33,1,0.625,0.4,td pd,.,td pd,14,13,1,0,right,right,0 falls in prev 12 months,No,56,34,20,N
BAT012PRE_kellymi_values,EMG_BFLH_L_APR1,60.33813704,42.18275905,BFLH_L,BFLH,L,APR_1_TIMEBIN,BAT012PRE,M,66,176.5,75.2,24.1,0,0,0,0,0,1,0,Yes,1,22,89.375,0,0,0,0,0,0,1,1,2,1,0,0,2,28,M,28,2,0.125,0.4,pigd pd,pigd,pigd pd,13,9,1,1,right,bilateral,0 falls in prev 12 months,No,53,26,19,Y
BAT013PRE_kellymi_values,EMG_BFLH_L_APR1,65.46226808,61.9654201,BFLH_L,BFLH,L,APR_1_TIMEBIN,BAT013PRE,M,66,179,92.7,28.9,1,0,0,0,0,1,2,Yes,1,29,93.125,0,0,0,0,0,0,1,0,0,1,0,1,2,30,M,30,2,0.375,0.6,pigd pd,pigd,pigd pd,8,12,1,1,left,bilateral,1 fall in prev 12 months,Yes,54,35,24,N
BAT014PRE_kellymi_values,EMG_BFLH_L_APR1,88.96561197,88.36968123,BFLH_L,BFLH,L,APR_1_TIMEBIN,BAT014PRE,F,54,163,66,24.8,0,0,0,0,0,0,1,Yes,4,30,96.875,0,0,0,0,0,0,1,0,0,0,0,0,1.5,24,F,24,2,0.25,0.4,pigd pd,pigd,pigd pd,3,15,0,2,left,left,0 falls in prev 12 months,No,55,37,23,N
BAT015PRE_kellymi_values,EMG_BFLH_L_APR1,84.61957141,82.15528006,BFLH_L,BFLH,L,APR_1_TIMEBIN,BAT015PRE,F,73,147.5,71.5,32.9,0,0,1,0,1,2,1,Yes,7,28,77.5,0,0,0,0,0,0,3,1,3,1,1,2,2,20,F,20,0,0.125,1.2,pigd pd,pigd,pigd pd,6,5,0,0,right,bilateral,>=2 falls in prev 12 months,Yes,51,24,,Y
BAT016PRE_kellymi_values,EMG_BFLH_L_APR1,92.99091375,80.79379017,BFLH_L,BFLH,L,APR_1_TIMEBIN,BAT016PRE,F,75,153.5,50.3,21.3,180,15,1,3,3,1,0,Yes,10,25,61.25,0,0,0,0,0,0,3,2,1,1,1,1,3,43,F,43,5,0,2.2,pigd pd,pigd,pigd pd,17,15,3,2,right,right,>=2 falls in prev 12 months,Yes,42,14,12,Y
BAT018PRE_kellymi_values,EMG_BFLH_L_APR1,60.05218861,53.9320821,BFLH_L,BFLH,L,APR_1_TIMEBIN,BAT018PRE,M,82,166.25,71.8,26,0,0,0,0,0,1,1,Yes,3,29,96.875,0,0,0,0,0,0,1,0,0,0,0,0,2,39,M,39,5,0.5,0.2,td pd,.,td pd,13,18,3,2,left,right,0 falls in prev 12 months,No,53,30,23,N
BAT019PRE_kellymi_values,EMG_BFLH_L_APR1,68.22534962,65.92013094,BFLH_L,BFLH,L,APR_1_TIMEBIN,BAT019PRE,F,66,175,76.8,25.1,50,10,1,2,1,2,0,Yes,9,29,58.125,0,0,0,0,0,0,3,1,3,2,2,2,3,32,F,32,0,0.25,1.8,pigd pd,pigd,pigd pd,9,8,0,0,right,bilateral,>=2 falls in prev 12 months,Yes,45,20,15,Y
BAT020PRE_kellymi_values,EMG_BFLH_L_APR1,73.9698568,57.32040126,BFLH_L,BFLH,L,APR_1_TIMEBIN,BAT020PRE,M,68,182,80.9,24.4,10,2,1,1,1,2,1,Yes,14,28,80.625,0,0,0,0,0,0,2,1,3,1,1,1,3,46,M,46,6,1.125,1.2,pigd pd,pigd,pigd pd,17,17,5,3,bilateral,right,>=2 falls in prev 12 months,Yes,50,27,22,Y
BAT021PRE_kellymi_values,EMG_BFLH_L_APR1,84.78120988,84.78120988,BFLH_L,BFLH,L,APR_1_TIMEBIN,BAT021PRE,F,60,167.5,74.3,26.5,12,3,0,2,0,2,2,Yes,26,20,,1,0,0,0,0,0,2,2,0,0,0,0,3,34,F,34,0,0.625,1.2,pigd pd,pigd,pigd pd,9,13,0,0,left,bilateral,>=2 falls in prev 12 months,Yes,53,22,15,N
BAT022PRE_kellymi_values,EMG_BFLH_L_APR1,98.34868678,92.39895784,BFLH_L,BFLH,L,APR_1_TIMEBIN,BAT022PRE,M,67,174.25,80,26.3,4,1,1,2,3,2,0,Yes,14,27,60.625,2,0,2,0,2,2,3,2,3,2,2,1,2,20,M,20,0,0.125,1.8,pigd pd,pigd,pigd pd,7,9,0,0,left,bilateral,>=2 falls in prev 12 months,Yes,55,32,17,Y
BAT023PRE_kellymi_values,EMG_BFLH_L_APR1,75.1302781,69.57967454,BFLH_L,BFLH,L,APR_1_TIMEBIN,BAT023PRE,F,73,159,65.4,25.9,0,0,0,0,0,1,1,Yes,7,26,92.5,0,0,0,0,0,0,0,0,0,0,0,0,1,15,F,15,1,0.25,0.2,indet pd,.,indet pd,4,9,0,1,left,left,0 falls in prev 12 months,No,56,33,23,N
BAT024PRE_kellymi_values,EMG_BFLH_L_APR1,52.58487271,28.14985275,BFLH_L,BFLH,L,APR_1_TIMEBIN,BAT024PRE,M,72,186.5,74.8,21.5,0,0,0,0,0,1,2,Yes,1,24,84.375,0,0,0,0,0,0,1,0,0,0,0,1,1.5,14,M,14,1,0.375,0.4,pigd pd,pigd,pigd pd,7,5,1,0,right,right,0 falls in prev 12 months,No,55,33,24,N
BAT025PRE_kellymi_values,EMG_BFLH_L_APR1,45.91984181,17.54667873,BFLH_L,BFLH,L,APR_1_TIMEBIN,BAT025PRE,M,64,177,105.7,33.7,0,0,1,0,1,2,2,Yes,7,28,87.5,0,0,0,0,0,0,1,1,2,0,1,0,2,25,M,25,3,0.5,0.8,pigd pd,pigd,pigd pd,9,9,2,1,bilateral,right,0 falls in prev 12 months,No,52,29,19,Y
BAT026PRE_kellymi_values,EMG_BFLH_L_APR1,61.26084914,60.57909328,BFLH_L,BFLH,L,APR_1_TIMEBIN,BAT026PRE,F,67,164.7,88,32.4,10,4,1,2,1,2,1,Yes,12,25,85.625,0,0,0,0,0,0,2,0,3,2,2,1,2.5,41,F,41,5,0.375,1.4,pigd pd,pigd,pigd pd,16,14,3,2,right,right,>=2 falls in prev 12 months,Yes,44,18,17,Y
BAT027PRE_kellymi_values,EMG_BFLH_L_APR1,42.81868639,25.60601972,BFLH_L,BFLH,L,APR_1_TIMEBIN,BAT027PRE,M,74,177.8,88.1,27.9,0,0,0,0,0,0,1,Yes,3,26,87.5,0,0,0,0,0,0,1,1,0,0,1,0,2,31,M,31,0,0.5,0.4,indet pd,.,indet pd,9,13,0,0,left,bilateral,1 fall in prev 12 months,Yes,55,25,18,N
BAT028PRE_kellymi_values,EMG_BFLH_L_APR1,78.09030095,49.82423056,BFLH_L,BFLH,L,APR_1_TIMEBIN,BAT028PRE,M,67,167.5,90.8,32.4,0,0,0,0,0,0,2,Yes,1,26,100,0,0,0,0,0,0,1,0,0,0,0,0,2,35,M,35,4,0.75,0.4,td pd,.,td pd,12,17,2,2,left,bilateral,>=2 falls in prev 12 months,Yes,56,33,23,N
BAT029PRE_kellymi_values,EMG_BFLH_L_APR1,81.91541266,81.91541266,BFLH_L,BFLH,L,APR_1_TIMEBIN,BAT029PRE,M,68,169.75,69.5,24.1,5,1,1,2,2,2,2,Yes,16,26,,0,0,0,0,0,0,,,,,,,3,51,M,51,5,1.625,1.8,pigd pd,pigd,pigd pd,21,18,3,2,right,right,>=2 falls in prev 12 months,Yes,48,25,16,.
BAT030PRE_kellymi_values,EMG_BFLH_L_APR1,60.94064932,60.94064932,BFLH_L,BFLH,L,APR_1_TIMEBIN,BAT030PRE,M,67,175,79.5,26,1,0,0,0,0,1,0,Yes,12,27,85.625,0,0,0,0,0,0,1,0,0,0,0,0,3,38,M,38,5,0.25,1,pigd pd,pigd,pigd pd,16,12,3,2,right,right,1 fall in prev 12 months,Yes,46,30,20,N
BAT031PRE_kellymi_values,EMG_BFLH_L_APR1,62.42864889,60.52153717,BFLH_L,BFLH,L,APR_1_TIMEBIN,BAT031PRE,M,63,179.75,88.6,27.4,0,0,1,0,0,1,2,Yes,5,24,99.375,0,0,0,0,0,0,0,0,1,1,0,1,1.5,28,M,28,0,0.875,0.4,td pd,.,td pd,6,15,0,1,left,left,0 falls in prev 12 months,No,55,32,22,Y
BAT032PRE_kellymi_values,EMG_BFLH_L_APR1,52.65242961,43.09650956,BFLH_L,BFLH,L,APR_1_TIMEBIN,BAT032PRE,F,71,164,58,21.6,1,0,1,0,1,1,1,Yes,13,28,91.875,0,0,0,0,0,0,1,0,1,1,1,1,1.5,18,F,18,0,0.5,0.6,pigd pd,pigd,pigd pd,7,9,0,0,left,bilateral,>=2 falls in prev 12 months,Yes,56,31,21,Y
BAT033PRE_kellymi_values,EMG_BFLH_L_APR1,35.53431456,30.640516,BFLH_L,BFLH,L,APR_1_TIMEBIN,BAT033PRE,F,65,162,78.1,29.8,1,0,1,1,1,1,1,Yes,11,27,,0,0,0,0,0,0,,,,,,,2,38,F,38,5,0.25,1.2,pigd pd,pigd,pigd pd,14,12,3,2,right,right,>=2 falls in prev 12 months,Yes,46,23,12,.
BAT101PRE_kellymi_values,EMG_BFLH_L_APR1,85.54748304,80.69388186,BFLH_L,BFLH,L,APR_1_TIMEBIN,BAT101PRE,F,55,162.75,59.9,22.6,0,0,0,0,0,0,1,No,,27,96.875,,,,,,,,,,,,,,,F,0,,1,0,.,hoa,hoa,,,,,,,0 falls in prev 12 months,No,56,36,22,.
BAT102PRE_kellymi_values,EMG_BFLH_L_APR1,48.91605078,48.91605078,BFLH_L,BFLH,L,APR_1_TIMEBIN,BAT102PRE,F,54,162,66.7,25.4,0,0,0,0,0,0,0,No,,27,90.625,,,,,,,,,,,,,,,F,0,,0,0,.,hoa,hoa,,,,,,,0 falls in prev 12 months,No,53,35,22,.
BAT103PRE_kellymi_values,EMG_BFLH_L_APR1,36.75670726,36.75670726,BFLH_L,BFLH,L,APR_1_TIMEBIN,BAT103PRE,M,86,161.8,76.7,29.3,0,0,0,0,0,0,0,No,,24,100,,,,,,,,,,,,,,,M,0,,0,0,.,hoa,hoa,,,,,,,0 falls in prev 12 months,No,54,27,22,.
BAT104PRE_kellymi_values,EMG_BFLH_L_APR1,65.95955363,50.06343399,BFLH_L,BFLH,L,APR_1_TIMEBIN,BAT104PRE,M,58,164.5,67.2,24.8,1,0,0,0,0,0,0,No,,21,92.5,,,,,,,,,,,,,,,M,0,,0,0,.,hoa,hoa,,,,,,,1 fall in prev 12 months,Yes,56,36,23,.
BAT105PRE_kellymi_values,EMG_BFLH_L_APR1,85.57483076,85.57483076,BFLH_L,BFLH,L,APR_1_TIMEBIN,BAT105PRE,F,59,160.8,81.1,31.4,0,0,0,0,,,,No,,27,100,,,,,,,,,,,,,,,F,0,,,0,.,hoa,hoa,,,,,,,0 falls in prev 12 months,No,54,35,19,.
BAT108PRE_kellymi_values,EMG_BFLH_L_APR1,76.41760276,71.87852371,BFLH_L,BFLH,L,APR_1_TIMEBIN,BAT108PRE,F,70,157,51,20.7,0,0,0,0,,,,No,,29,95.625,,,,,,,,,,,,,,,F,0,,,0,.,hoa,hoa,,,,,,,0 falls in prev 12 months,No,56,34,23,.
BAT109PRE_kellymi_values,EMG_BFLH_L_APR1,67.6202025,64.84086124,BFLH_L,BFLH,L,APR_1_TIMEBIN,BAT109PRE,F,61,162.6,59.5,22.5,0,0,0,0,0,0,0,No,,25,97.5,,,,,,,,,,,,,,,F,0,,0,0,.,hoa,hoa,,,,,,,0 falls in prev 12 months,No,56,29,23,.
BAT110PRE_kellymi_values,EMG_BFLH_L_APR1,49.22183555,38.06380111,BFLH_L,BFLH,L,APR_1_TIMEBIN,BAT110PRE,M,57,172.3,79.3,26.7,0,0,0,0,0,0,0,No,,23,100,,,,,,,,,,,,,,,M,0,,0,0,.,hoa,hoa,,,,,,,0 falls in prev 12 months,No,56,36,24,.
BAT111PRE_kellymi_values,EMG_BFLH_L_APR1,73.58843528,70.5818911,BFLH_L,BFLH,L,APR_1_TIMEBIN,BAT111PRE,F,70,170.5,62.2,21.4,0,0,0,0,0,0,0,No,,27,100,,,,,,,,,,,,,,,F,0,,0,0,.,hoa,hoa,,,,,,,0 falls in prev 12 months,No,53,28,23,.
BAT112PRE_kellymi_values,EMG_BFLH_L_APR1,65.41792046,44.41621907,BFLH_L,BFLH,L,APR_1_TIMEBIN,BAT112PRE,F,68,163,77.9,29.3,1,0,0,0,0,0,0,No,,25,95.625,,,,,,,,,,,,,,,F,0,,0,0,.,hoa,hoa,,,,,,,>=2 falls in prev 12 months,Yes,56,34,22,.
BAT113PRE_kellymi_values,EMG_BFLH_L_APR1,60.78307237,52.37764304,BFLH_L,BFLH,L,APR_1_TIMEBIN,BAT113PRE,M,64,179,72.2,22.5,1,0,0,0,0,1,0,No,,30,95.625,,,,,,,,,,,,,,,M,0,,0,0.333333333,.,hoa,hoa,,,,,,,1 fall in prev 12 months,Yes,56,33,24,.
BAT114PRE_kellymi_values,EMG_BFLH_L_APR1,75.70404263,75.70404263,BFLH_L,BFLH,L,APR_1_TIMEBIN,BAT114PRE,M,64,170.3,89.6,30.9,0,0,0,0,0,0,0,No,,26,95,,,,,,,,,,,,,,,M,0,,0,0,.,hoa,hoa,,,,,,,0 falls in prev 12 months,No,56,34,24,.
BAT116PRE_kellymi_values,EMG_BFLH_L_APR1,44.29444763,35.76071955,BFLH_L,BFLH,L,APR_1_TIMEBIN,BAT116PRE,M,72,182.5,99.5,29.9,0,0,0,0,0,0,0,No,,26,,,,,,,,,,,,,,,,M,0,,0,0,.,hoa,hoa,,,,,,,0 falls in prev 12 months,No,54,33,22,.
BAT001PRE_kellymi_values,EMG_BFLH_L_APRX,63.8944516,30.78863929,BFLH_L,BFLH,L,APR_X_TIMEBIN,BAT001PRE,F,84,163.83,49.89,18.6,2,1,1,0,0,0,1,Yes,17,28,,0,0,0,0,0,0,1,0,2,1,0,1,2.5,44,F,44,1,1.125,0,td pd,.,td pd,18,17,1,1,right,bilateral,>=2 falls in prev 12 months,Yes,52,29,20,Y
BAT002PRE_kellymi_values,EMG_BFLH_L_APRX,71.19785483,40.28557979,BFLH_L,BFLH,L,APR_X_TIMEBIN,BAT002PRE,M,53,175.26,86.1826,28.1,0,0,0,0,0,0,1,Yes,4,29,,0,0,0,0,0,0,0,0,0,0,0,0,1.5,21,M,21,1,0.75,0.2,td pd,.,td pd,10,5,1,0,right,right,0 falls in prev 12 months,No,56,32,21,N
BAT003PRE_kellymi_values,EMG_BFLH_L_APRX,74.44893466,36.74330841,BFLH_L,BFLH,L,APR_X_TIMEBIN,BAT003PRE,F,75,163.5,57.6,21.5,4,2,1,0,0,1,0,Yes,2,27,,0,0,0,0,0,0,1,0,0,1,1,0,2.5,31,F,31,2,0.25,0.6,pigd pd,pigd,pigd pd,12,11,2,0,right,right,>=2 falls in prev 12 months,Yes,52,29,22,N
BAT004PRE_kellymi_values,EMG_BFLH_L_APRX,68.59236696,55.0669687,BFLH_L,BFLH,L,APR_X_TIMEBIN,BAT004PRE,F,82,168,59.9,21.2,0,0,1,0,2,1,1,Yes,3,24,,0,0,0,0,0,0,3,2,4,2,2,2,3,37,F,37,0,0.5,1.4,pigd pd,pigd,pigd pd,10,13,0,0,left,bilateral,0 falls in prev 12 months,No,44,29,,Y
BAT005PRE_kellymi_values,EMG_BFLH_L_APRX,52.8126338,52.8126338,BFLH_L,BFLH,L,APR_X_TIMEBIN,BAT005PRE,M,39,184,70.8,20.9,3,1,0,0,0,2,4,Yes,9,28,,0,0,0,0,0,0,3,3,3,0,1,1,2.5,38,M,38,0,1.875,0.6,td pd,.,td pd,9,21,1,1,left,bilateral,>=2 falls in prev 12 months,Yes,56,36,23,Y
BAT006PRE_kellymi_values,EMG_BFLH_L_APRX,67.64798087,52.58861373,BFLH_L,BFLH,L,APR_X_TIMEBIN,BAT006PRE,M,66,181.5,83.6,25.4,0,0,0,0,0,0,0,Yes,1,24,,0,0,0,0,0,0,1,1,0,0,0,0,2,22,M,22,3,0.125,0.2,pigd pd,pigd,pigd pd,6,9,1,2,left,left,0 falls in prev 12 months,No,55,32,20,N
BAT007PRE_kellymi_values,EMG_BFLH_L_APRX,79.15146625,58.63737156,BFLH_L,BFLH,L,APR_X_TIMEBIN,BAT007PRE,M,59,186,89.4,25.8,0,1,1,0,1,1,1,Yes,6,27,,0,0,0,0,0,0,2,1,2,1,0,1,2,34,M,34,0,0.625,0.6,indet pd,.,indet pd,11,13,0,0,left,bilateral,0 falls in prev 12 months,No,56,37,23,Y
BAT008PRE_kellymi_values,EMG_BFLH_L_APRX,48.30196791,2.327411556,BFLH_L,BFLH,L,APR_X_TIMEBIN,BAT008PRE,F,71,155.5,63.8,26.4,0,0,0,0,0,1,1,Yes,3,30,,0,0,0,0,0,0,1,0,0,0,0,0,2,30,F,30,0,1.125,0.6,td pd,.,td pd,14,10,2,0,right,right,0 falls in prev 12 months,No,56,36,23,N
BAT010PRE_kellymi_values,EMG_BFLH_L_APRX,78.7920221,57.4306306,BFLH_L,BFLH,L,APR_X_TIMEBIN,BAT010PRE,F,69,153.5,45.9,19.5,0,0,0,0,0,1,1,Yes,6,25,,0,0,0,0,0,0,1,0,0,0,0,0,3,43,F,43,1,1.25,0.6,td pd,.,td pd,17,17,3,1,bilateral,right,>=2 falls in prev 12 months,Yes,56,33,23,N
BAT011PRE_kellymi_values,EMG_BFLH_L_APRX,41.94128849,37.10070035,BFLH_L,BFLH,L,APR_X_TIMEBIN,BAT011PRE,M,71,170,63.4,21.9,0,0,0,0,0,0,0,Yes,5,,,0,0,0,0,0,0,2,0,0,0,0,0,2,33,M,33,1,0.625,0.4,td pd,.,td pd,14,13,1,0,right,right,0 falls in prev 12 months,No,56,34,20,N
BAT012PRE_kellymi_values,EMG_BFLH_L_APRX,58.63369858,35.62032994,BFLH_L,BFLH,L,APR_X_TIMEBIN,BAT012PRE,M,66,176.5,75.2,24.1,0,0,0,0,0,1,0,Yes,1,22,,0,0,0,0,0,0,1,1,2,1,0,0,2,28,M,28,2,0.125,0.4,pigd pd,pigd,pigd pd,13,9,1,1,right,bilateral,0 falls in prev 12 months,No,53,26,19,Y
BAT013PRE_kellymi_values,EMG_BFLH_L_APRX,71.88932543,71.28368785,BFLH_L,BFLH,L,APR_X_TIMEBIN,BAT013PRE,M,66,179,92.7,28.9,1,0,0,0,0,1,2,Yes,1,29,,0,0,0,0,0,0,1,0,0,1,0,1,2,30,M,30,2,0.375,0.6,pigd pd,pigd,pigd pd,8,12,1,1,left,bilateral,1 fall in prev 12 months,Yes,54,35,24,N
BAT014PRE_kellymi_values,EMG_BFLH_L_APRX,92.65138177,82.93413521,BFLH_L,BFLH,L,APR_X_TIMEBIN,BAT014PRE,F,54,163,66,24.8,0,0,0,0,0,0,1,Yes,4,30,,0,0,0,0,0,0,1,0,0,0,0,0,1.5,24,F,24,2,0.25,0.4,pigd pd,pigd,pigd pd,3,15,0,2,left,left,0 falls in prev 12 months,No,55,37,23,N
BAT015PRE_kellymi_values,EMG_BFLH_L_APRX,83.76819323,83.76819323,BFLH_L,BFLH,L,APR_X_TIMEBIN,BAT015PRE,F,73,147.5,71.5,32.9,0,0,1,0,1,2,1,Yes,7,28,,0,0,0,0,0,0,3,1,3,1,1,2,2,20,F,20,0,0.125,1.2,pigd pd,pigd,pigd pd,6,5,0,0,right,bilateral,>=2 falls in prev 12 months,Yes,51,24,,Y
BAT016PRE_kellymi_values,EMG_BFLH_L_APRX,90.01033845,70.87824717,BFLH_L,BFLH,L,APR_X_TIMEBIN,BAT016PRE,F,75,153.5,50.3,21.3,180,15,1,3,3,1,0,Yes,10,25,,0,0,0,0,0,0,3,2,1,1,1,1,3,43,F,43,5,0,2.2,pigd pd,pigd,pigd pd,17,15,3,2,right,right,>=2 falls in prev 12 months,Yes,42,14,12,Y
BAT018PRE_kellymi_values,EMG_BFLH_L_APRX,78.89605544,61.00656014,BFLH_L,BFLH,L,APR_X_TIMEBIN,BAT018PRE,M,82,166.25,71.8,26,0,0,0,0,0,1,1,Yes,3,29,,0,0,0,0,0,0,1,0,0,0,0,0,2,39,M,39,5,0.5,0.2,td pd,.,td pd,13,18,3,2,left,right,0 falls in prev 12 months,No,53,30,23,N
BAT019PRE_kellymi_values,EMG_BFLH_L_APRX,56.61303443,48.70042369,BFLH_L,BFLH,L,APR_X_TIMEBIN,BAT019PRE,F,66,175,76.8,25.1,50,10,1,2,1,2,0,Yes,9,29,,0,0,0,0,0,0,3,1,3,2,2,2,3,32,F,32,0,0.25,1.8,pigd pd,pigd,pigd pd,9,8,0,0,right,bilateral,>=2 falls in prev 12 months,Yes,45,20,15,Y
BAT020PRE_kellymi_values,EMG_BFLH_L_APRX,58.86378426,52.55686526,BFLH_L,BFLH,L,APR_X_TIMEBIN,BAT020PRE,M,68,182,80.9,24.4,10,2,1,1,1,2,1,Yes,14,28,,0,0,0,0,0,0,2,1,3,1,1,1,3,46,M,46,6,1.125,1.2,pigd pd,pigd,pigd pd,17,17,5,3,bilateral,right,>=2 falls in prev 12 months,Yes,50,27,22,Y
BAT021PRE_kellymi_values,EMG_BFLH_L_APRX,70.46340481,69.20726397,BFLH_L,BFLH,L,APR_X_TIMEBIN,BAT021PRE,F,60,167.5,74.3,26.5,12,3,0,2,0,2,2,Yes,26,20,,1,0,0,0,0,0,2,2,0,0,0,0,3,34,F,34,0,0.625,1.2,pigd pd,pigd,pigd pd,9,13,0,0,left,bilateral,>=2 falls in prev 12 months,Yes,53,22,15,N
BAT022PRE_kellymi_values,EMG_BFLH_L_APRX,87.71552507,53.59782307,BFLH_L,BFLH,L,APR_X_TIMEBIN,BAT022PRE,M,67,174.25,80,26.3,4,1,1,2,3,2,0,Yes,14,27,,2,0,2,0,2,2,3,2,3,2,2,1,2,20,M,20,0,0.125,1.8,pigd pd,pigd,pigd pd,7,9,0,0,left,bilateral,>=2 falls in prev 12 months,Yes,55,32,17,Y
BAT023PRE_kellymi_values,EMG_BFLH_L_APRX,56.71860063,32.47144131,BFLH_L,BFLH,L,APR_X_TIMEBIN,BAT023PRE,F,73,159,65.4,25.9,0,0,0,0,0,1,1,Yes,7,26,,0,0,0,0,0,0,0,0,0,0,0,0,1,15,F,15,1,0.25,0.2,indet pd,.,indet pd,4,9,0,1,left,left,0 falls in prev 12 months,No,56,33,23,N
BAT024PRE_kellymi_values,EMG_BFLH_L_APRX,53.58131719,32.55207072,BFLH_L,BFLH,L,APR_X_TIMEBIN,BAT024PRE,M,72,186.5,74.8,21.5,0,0,0,0,0,1,2,Yes,1,24,,0,0,0,0,0,0,1,0,0,0,0,1,1.5,14,M,14,1,0.375,0.4,pigd pd,pigd,pigd pd,7,5,1,0,right,right,0 falls in prev 12 months,No,55,33,24,N
BAT025PRE_kellymi_values,EMG_BFLH_L_APRX,39.43579853,33.34041725,BFLH_L,BFLH,L,APR_X_TIMEBIN,BAT025PRE,M,64,177,105.7,33.7,0,0,1,0,1,2,2,Yes,7,28,,0,0,0,0,0,0,1,1,2,0,1,0,2,25,M,25,3,0.5,0.8,pigd pd,pigd,pigd pd,9,9,2,1,bilateral,right,0 falls in prev 12 months,No,52,29,19,Y
BAT026PRE_kellymi_values,EMG_BFLH_L_APRX,58.8653906,52.86982407,BFLH_L,BFLH,L,APR_X_TIMEBIN,BAT026PRE,F,67,164.7,88,32.4,10,4,1,2,1,2,1,Yes,12,25,,0,0,0,0,0,0,2,0,3,2,2,1,2.5,41,F,41,5,0.375,1.4,pigd pd,pigd,pigd pd,16,14,3,2,right,right,>=2 falls in prev 12 months,Yes,44,18,17,Y
BAT027PRE_kellymi_values,EMG_BFLH_L_APRX,45.49620072,6.586696581,BFLH_L,BFLH,L,APR_X_TIMEBIN,BAT027PRE,M,74,177.8,88.1,27.9,0,0,0,0,0,0,1,Yes,3,26,,0,0,0,0,0,0,1,1,0,0,1,0,2,31,M,31,0,0.5,0.4,indet pd,.,indet pd,9,13,0,0,left,bilateral,1 fall in prev 12 months,Yes,55,25,18,N
BAT028PRE_kellymi_values,EMG_BFLH_L_APRX,67.44548818,-57.92488812,BFLH_L,BFLH,L,APR_X_TIMEBIN,BAT028PRE,M,67,167.5,90.8,32.4,0,0,0,0,0,0,2,Yes,1,26,,0,0,0,0,0,0,1,0,0,0,0,0,2,35,M,35,4,0.75,0.4,td pd,.,td pd,12,17,2,2,left,bilateral,>=2 falls in prev 12 months,Yes,56,33,23,N
BAT029PRE_kellymi_values,EMG_BFLH_L_APRX,56.09487024,34.37689126,BFLH_L,BFLH,L,APR_X_TIMEBIN,BAT029PRE,M,68,169.75,69.5,24.1,5,1,1,2,2,2,2,Yes,16,26,,0,0,0,0,0,0,,,,,,,3,51,M,51,5,1.625,1.8,pigd pd,pigd,pigd pd,21,18,3,2,right,right,>=2 falls in prev 12 months,Yes,48,25,16,.
BAT030PRE_kellymi_values,EMG_BFLH_L_APRX,54.59946734,28.10515685,BFLH_L,BFLH,L,APR_X_TIMEBIN,BAT030PRE,M,67,175,79.5,26,1,0,0,0,0,1,0,Yes,12,27,,0,0,0,0,0,0,1,0,0,0,0,0,3,38,M,38,5,0.25,1,pigd pd,pigd,pigd pd,16,12,3,2,right,right,1 fall in prev 12 months,Yes,46,30,20,N
BAT031PRE_kellymi_values,EMG_BFLH_L_APRX,77.97289668,61.57423583,BFLH_L,BFLH,L,APR_X_TIMEBIN,BAT031PRE,M,63,179.75,88.6,27.4,0,0,1,0,0,1,2,Yes,5,24,,0,0,0,0,0,0,0,0,1,1,0,1,1.5,28,M,28,0,0.875,0.4,td pd,.,td pd,6,15,0,1,left,left,0 falls in prev 12 months,No,55,32,22,Y
BAT032PRE_kellymi_values,EMG_BFLH_L_APRX,66.35846942,4.924190723,BFLH_L,BFLH,L,APR_X_TIMEBIN,BAT032PRE,F,71,164,58,21.6,1,0,1,0,1,1,1,Yes,13,28,,0,0,0,0,0,0,1,0,1,1,1,1,1.5,18,F,18,0,0.5,0.6,pigd pd,pigd,pigd pd,7,9,0,0,left,bilateral,>=2 falls in prev 12 months,Yes,56,31,21,Y
BAT033PRE_kellymi_values,EMG_BFLH_L_APRX,71.09517156,3.491864165,BFLH_L,BFLH,L,APR_X_TIMEBIN,BAT033PRE,F,65,162,78.1,29.8,1,0,1,1,1,1,1,Yes,11,27,,0,0,0,0,0,0,,,,,,,2,38,F,38,5,0.25,1.2,pigd pd,pigd,pigd pd,14,12,3,2,right,right,>=2 falls in prev 12 months,Yes,46,23,12,.
BAT101PRE_kellymi_values,EMG_BFLH_L_APRX,86.80440055,63.3351133,BFLH_L,BFLH,L,APR_X_TIMEBIN,BAT101PRE,F,55,162.75,59.9,22.6,0,0,0,0,0,0,1,No,,27,,,,,,,,0,0,0,0,0,0,,,F,0,,1,0,.,hoa,hoa,,,,,,,0 falls in prev 12 months,No,56,36,22,.
BAT102PRE_kellymi_values,EMG_BFLH_L_APRX,83.59455686,75.93567183,BFLH_L,BFLH,L,APR_X_TIMEBIN,BAT102PRE,F,54,162,66.7,25.4,0,0,0,0,0,0,0,No,,27,,,,,,,,0,0,0,0,0,0,,,F,0,,0,0,.,hoa,hoa,,,,,,,0 falls in prev 12 months,No,53,35,22,.
BAT103PRE_kellymi_values,EMG_BFLH_L_APRX,39.45712973,24.95898964,BFLH_L,BFLH,L,APR_X_TIMEBIN,BAT103PRE,M,86,161.8,76.7,29.3,0,0,0,0,0,0,0,No,,24,,,,,,,,0,0,,,,,,,M,0,,0,0,.,hoa,hoa,,,,,,,0 falls in prev 12 months,No,54,27,22,.
BAT104PRE_kellymi_values,EMG_BFLH_L_APRX,71.70730453,29.65553739,BFLH_L,BFLH,L,APR_X_TIMEBIN,BAT104PRE,M,58,164.5,67.2,24.8,1,0,0,0,0,0,0,No,,21,,,,,,,,0,0,,,,,,,M,0,,0,0,.,hoa,hoa,,,,,,,1 fall in prev 12 months,Yes,56,36,23,.
BAT105PRE_kellymi_values,EMG_BFLH_L_APRX,83.57747109,70.48398777,BFLH_L,BFLH,L,APR_X_TIMEBIN,BAT105PRE,F,59,160.8,81.1,31.4,0,0,0,0,,,,No,,27,,,,,,,,,,,,,,,,F,0,,,0,.,hoa,hoa,,,,,,,0 falls in prev 12 months,No,54,35,19,.
BAT108PRE_kellymi_values,EMG_BFLH_L_APRX,61.12994185,40.97018426,BFLH_L,BFLH,L,APR_X_TIMEBIN,BAT108PRE,F,70,157,51,20.7,0,0,0,0,,,,No,,29,,,,,,,,,,,,,,,,F,0,,,0,.,hoa,hoa,,,,,,,0 falls in prev 12 months,No,56,34,23,.
BAT109PRE_kellymi_values,EMG_BFLH_L_APRX,75.71807722,39.51791379,BFLH_L,BFLH,L,APR_X_TIMEBIN,BAT109PRE,F,61,162.6,59.5,22.5,0,0,0,0,0,0,0,No,,25,,,,,,,,,,,,,,,,F,0,,0,0,.,hoa,hoa,,,,,,,0 falls in prev 12 months,No,56,29,23,.
BAT110PRE_kellymi_values,EMG_BFLH_L_APRX,48.86004557,24.0292493,BFLH_L,BFLH,L,APR_X_TIMEBIN,BAT110PRE,M,57,172.3,79.3,26.7,0,0,0,0,0,0,0,No,,23,,,,,,,,,,,,,,,,M,0,,0,0,.,hoa,hoa,,,,,,,0 falls in prev 12 months,No,56,36,24,.
BAT111PRE_kellymi_values,EMG_BFLH_L_APRX,72.20518083,27.29349247,BFLH_L,BFLH,L,APR_X_TIMEBIN,BAT111PRE,F,70,170.5,62.2,21.4,0,0,0,0,0,0,0,No,,27,,,,,,,,,,,,,,,,F,0,,0,0,.,hoa,hoa,,,,,,,0 falls in prev 12 months,No,53,28,23,.
BAT112PRE_kellymi_values,EMG_BFLH_L_APRX,65.05378934,8.961120444,BFLH_L,BFLH,L,APR_X_TIMEBIN,BAT112PRE,F,68,163,77.9,29.3,1,0,0,0,0,0,0,No,,25,,,,,,,,,,,,,,,,F,0,,0,0,.,hoa,hoa,,,,,,,>=2 falls in prev 12 months,Yes,56,34,22,.
BAT113PRE_kellymi_values,EMG_BFLH_L_APRX,58.54654696,33.72047296,BFLH_L,BFLH,L,APR_X_TIMEBIN,BAT113PRE,M,64,179,72.2,22.5,1,0,0,0,0,1,0,No,,30,,,,,,,,,,,,,,,,M,0,,0,0.333333333,.,hoa,hoa,,,,,,,1 fall in prev 12 months,Yes,56,33,24,.
BAT114PRE_kellymi_values,EMG_BFLH_L_APRX,69.45711668,1.576340597,BFLH_L,BFLH,L,APR_X_TIMEBIN,BAT114PRE,M,64,170.3,89.6,30.9,0,0,0,0,0,0,0,No,,26,,,,,,,,,,,,,,,,M,0,,0,0,.,hoa,hoa,,,,,,,0 falls in prev 12 months,No,56,34,24,.
BAT116PRE_kellymi_values,EMG_BFLH_L_APRX,71.77224259,1.647955401,BFLH_L,BFLH,L,APR_X_TIMEBIN,BAT116PRE,M,72,182.5,99.5,29.9,0,0,0,0,0,0,0,No,,26,,,,,,,,,,,,,,,,M,0,,0,0,.,hoa,hoa,,,,,,,0 falls in prev 12 months,No,54,33,22,.